{"text_format":"1","workbook":"xlsx","n_sheets":4,"sheets":["Assets","Sheet2","Options","Sheet1"],"not_rendered":{"charts":0,"images":0,"macros":1,"external_links":1,"defined_names":1,"comments":0,"pivot_tables":0},"unopened":[],"bounds":{"document_bytes":16777216,"sheet_cells":100000,"rows_first":2000,"rows_last":500,"rows_between":2000,"halvings":0,"cell_chars":16384,"cell_head_chars":4096},"cells_cut":0,"cells_raw":0,"read":"whole","date_system":"1900"}

{"sheet":"Assets","index":0,"n_rows":46,"n_cols":13,"rows_kept":46,"cut":false,"hidden":false,"merged":[]}
["Import Datei Name","Asset Name (Anzeigename im System)","Asset Typ","Keywords (kommagetrennt)","Bildrecht","Vertragsdateiname","PIM relevant","Released","Related Products (ZMP oder EAN kommagetrennt)","Product Code Nafta","Language","Country of Origin","Getty ID"]
["RU C-DE.AYA46.B.85892 29.06.2018-28.06.2023 ROSTEST-Moskva.pdf",null,null,null,null,null,null,null,"4058075817739,4058075817777,4058075817753,4058075817791"]
["RU C-DE.AYA46.B.87420 06.09.2018-28.06.2023 ROSTEST-Moskva.pdf",null,null,null,null,null,null,null,"4052899937154,4052899956384,4058075183001,4058075183087,4058075183063,4058075183100,4058075454743,4058075454767,4058075454781,4058075454804,4058075454828,4058075454842,4058075187337,4058075187351,4058075187375,4058075187399,4058075187634,4058075187658,4058075136410,4058075024632,4058075024717,4058075454620,4058075454644,4058075454668,4058075454682,4058075454705,4058075454729,4058075454446,4058075454460,4058075454484,4058075454507,4058075454521,4058075454545,4058075454569,4058075454583,4058075454606,4058075136472,4058075136458"]
["RU C-DE.AJ40.B.00590_19 29.10.2019-28.10.2024 SamaraTest.pdf",null,null,null,null,null,null,null,"4058075056688,4058075315822,4058075315853,4058075811553,4058075271791,4058075811454,4058075812697,4058075811515,4058075811812,4058075812710,4058075271845,4058075271890"]
["RU_RU C-DE.AJ40.B.00751_19 28.12.2019-27.12.2024 SamaraTest.pdf",null,null,null,null,null,null,null,"4058075134782,4058075134812,4058075403376,4058075403406,4058075210981,4058075211018,4058075448728,4058075448704,4058075448681,4058075449107,4058075449084,4058075449060,4058075449282,4058075449268,4058075449244,4058075449169,4058075449145,4058075449121,4058075449220,4058075449183,4058075449206,4058075449343,4058075449329,4058075449305,4052899958104,4052899451735,4052899958128,4058075815636,4058075815674,4058075096462,4058075096448,4058075449046,4058075449022,4058075449008,4058075260078,4058075051669,4058075061149,4058075260092,4058075061187,4058075260030,4058075260016,4058075259997,4058075259898,4058075259973,4058075259959,4058075259874,4058075260139,4058075260115,4058075260054,4058075095489,4058075095441,4058075095540,4058075096561,4058075259935,4058075259911,4058075259850,4052899958111,4058075023475,4052899958142,4052899958173,4058075815872,4058075815650,4052899958180,4058075096486,4058075105638,4058075481343,4058075481374,4058075481404,4058075481497,4058075481527,4058075481558"]
["EAC RU C-DE.AYA46.B.15162_20 20.08.2020-19.08.2025 Rostest-Moskva.pdf",null,null,null,null,null,null,null,"4052899971660,4058075160842,4058075160897,4058075057142,4058075369009,4058075369030,4058075431652,4058075431638,4058075431614,4058075449589,4058075449565,4058075449541,4058075449527,4058075449503,4058075449480,4058075431577,4058075431553,4058075431539,4058075431492,4058075431478,4058075431430,4058075449466,4058075449442,4058075449428,4058075431379,4058075431355,4058075431317,4058075431256,4058075431218,4058075431157,4058075449404,4058075449381,4058075449367,4058075448407,4058075448766,4058075448780,4058075448469,4058075448483,4058075448445,4058075448421,4058075448889,4058075448902,4058075448926,4058075448841,4058075448865,4058075448742,4058075432093,4058075271944,4058075271746,4058075432048,4058075095120,4052899957749,4058075811959,4058075811430,4058075812017,4058075263925,4058075105195,4058075105157,4058075481282,4058075481312"]
["RU C-DE.AYA46.B.89892 23.11.2018-27.02.2023 ROSTEST-Moskva.pdf",null,null,null,null,null,null,null,"4058075055292,4058075055315,4058075055339,4058075068353,4058075116672,4058075116702,4058075055452,4058075055391,4058075212398,4058075212428,4058075212336,4058075212367,4058075217805,4058075217836,4058075068377,4052899971639,4058075808706,4058075808980,4058075439856,4058075438514,4058075439597,4052899961654,4058075817173,4058075819658,4058075288645,4058075288669,4058075288683,4058075817135,4058075817234,4058075808416,4052899972360,4058075808997,4052899962095,4052899962071,4058075809406,4058075808171,4058075808188,4058075091979,4058075091993,4058075092013,4058075092037,4058075091955,4058075092112,4058075092136,4058075269941,4058075269989,4058075270008,4058075269965,4058075133471,4058075133426,4058075133525"]
["RU C-DE.AYA46.B.04192_19 08.05.2019-07.05.2024 ROSTEST-Moskva.pdf",null,null,null,null,null,null,null,"4052899149229,4052899971516,4058075086616,4052899971523,4058075096387,4058075096417,4058075161917,4052899971554,4058075086647,4052899971561,4052899971578,4058075086678,4052899971585,4058075056985,4058075057043,4058075318540,4058075318120,4052899971608,4058075056886,4058075134171,4058075134140,4058075134232,4058075134201,4058075210684,4058075210714,4058075210745,4058075210776,4052899971622,4052899971615,4058075056923,4052899971646,4058075134294,4058075134263,4058075134355,4058075134324,4058075210806,4058075210837,4058075210868,4058075210899,4058075055414,4058075055353,4058075055438,4058075282544,4058075282575,4058075282629,4058075282650,4058075463165,4058075463189,4058075463288,4058075463301,4058075463202,4058075463226,4058075463240,4058075463264,4058075463127,4058075463349,4058075463141,4058075264267,4058075264304,4058075264083,4058075264069,4058075264106,4052899961289,4052899961302,4058075448629,4058075448544,4058075448520,4058075448605,4058075448568,4058075448643,4058075448988,4058075318274,4058075467620,4058075467668,4058075467705,4058075467767,4058075467873,4058075467934"]
["RU C-DE.AYA46.B.85894 29.06.2018-28.06.2023 ROSTEST-Moskva.pdf",null,null,null,null,null,null,null,"4058075135086,4058075135109,4058075024915,4058075024939,4058075024977,4058075024991"]
["EAC RU C-DE.AYA46.B.14999_20 11.08.2020-10.08.2025 Rostest-Moskva.pdf",null,null,null,null,null,null,null,"4058075106635,4058075106666,4058075210929,4058075210950,4058075448803,4058075448827,4058075496378,4058075496408"]
{"$rows_left_out":37}
{"sheet":"Sheet2","index":1,"n_rows":46,"n_cols":2,"rows_kept":46,"cut":false,"hidden":false,"merged":[]}
["Import Datei Name","Related Products (ZMP oder EAN kommagetrennt)"]
["RU C-DE.AYA46.B.85892 29.06.2018-28.06.2023 ROSTEST-Moskva.pdf","4058075817739,4058075817777,4058075817753,4058075817791"]
["RU C-DE.AYA46.B.87420 06.09.2018-28.06.2023 ROSTEST-Moskva.pdf","4052899937154,4052899956384,4058075183001,4058075183087,4058075183063,4058075183100,4058075454743,4058075454767,4058075454781,4058075454804,4058075454828,4058075454842,4058075187337,4058075187351,4058075187375,4058075187399,4058075187634,4058075187658,4058075136410,4058075024632,4058075024717,4058075454620,4058075454644,4058075454668,4058075454682,4058075454705,4058075454729,4058075454446,4058075454460,4058075454484,4058075454507,4058075454521,4058075454545,4058075454569,4058075454583,4058075454606,4058075136472,4058075136458"]
["RU C-DE.AJ40.B.00590_19 29.10.2019-28.10.2024 SamaraTest.pdf","4058075056688,4058075315822,4058075315853,4058075811553,4058075271791,4058075811454,4058075812697,4058075811515,4058075811812,4058075812710,4058075271845,4058075271890"]
["RU_RU C-DE.AJ40.B.00751_19 28.12.2019-27.12.2024 SamaraTest.pdf","4058075134782,4058075134812,4058075403376,4058075403406,4058075210981,4058075211018,4058075448728,4058075448704,4058075448681,4058075449107,4058075449084,4058075449060,4058075449282,4058075449268,4058075449244,4058075449169,4058075449145,4058075449121,4058075449220,4058075449183,4058075449206,4058075449343,4058075449329,4058075449305,4052899958104,4052899451735,4052899958128,4058075815636,4058075815674,4058075096462,4058075096448,4058075449046,4058075449022,4058075449008,4058075260078,4058075051669,4058075061149,4058075260092,4058075061187,4058075260030,4058075260016,4058075259997,4058075259898,4058075259973,4058075259959,4058075259874,4058075260139,4058075260115,4058075260054,4058075095489,4058075095441,4058075095540,4058075096561,4058075259935,4058075259911,4058075259850,4052899958111,4058075023475,4052899958142,4052899958173,4058075815872,4058075815650,4052899958180,4058075096486,4058075105638,4058075481343,4058075481374,4058075481404,4058075481497,4058075481527,4058075481558"]
["EAC RU C-DE.AYA46.B.15162_20 20.08.2020-19.08.2025 Rostest-Moskva.pdf","4052899971660,4058075160842,4058075160897,4058075057142,4058075369009,4058075369030,4058075431652,4058075431638,4058075431614,4058075449589,4058075449565,4058075449541,4058075449527,4058075449503,4058075449480,4058075431577,4058075431553,4058075431539,4058075431492,4058075431478,4058075431430,4058075449466,4058075449442,4058075449428,4058075431379,4058075431355,4058075431317,4058075431256,4058075431218,4058075431157,4058075449404,4058075449381,4058075449367,4058075448407,4058075448766,4058075448780,4058075448469,4058075448483,4058075448445,4058075448421,4058075448889,4058075448902,4058075448926,4058075448841,4058075448865,4058075448742,4058075432093,4058075271944,4058075271746,4058075432048,4058075095120,4052899957749,4058075811959,4058075811430,4058075812017,4058075263925,4058075105195,4058075105157,4058075481282,4058075481312"]
["RU C-DE.AYA46.B.89892 23.11.2018-27.02.2023 ROSTEST-Moskva.pdf","4058075055292,4058075055315,4058075055339,4058075068353,4058075116672,4058075116702,4058075055452,4058075055391,4058075212398,4058075212428,4058075212336,4058075212367,4058075217805,4058075217836,4058075068377,4052899971639,4058075808706,4058075808980,4058075439856,4058075438514,4058075439597,4052899961654,4058075817173,4058075819658,4058075288645,4058075288669,4058075288683,4058075817135,4058075817234,4058075808416,4052899972360,4058075808997,4052899962095,4052899962071,4058075809406,4058075808171,4058075808188,4058075091979,4058075091993,4058075092013,4058075092037,4058075091955,4058075092112,4058075092136,4058075269941,4058075269989,4058075270008,4058075269965,4058075133471,4058075133426,4058075133525"]
["RU C-DE.AYA46.B.04192_19 08.05.2019-07.05.2024 ROSTEST-Moskva.pdf","4052899149229,4052899971516,4058075086616,4052899971523,4058075096387,4058075096417,4058075161917,4052899971554,4058075086647,4052899971561,4052899971578,4058075086678,4052899971585,4058075056985,4058075057043,4058075318540,4058075318120,4052899971608,4058075056886,4058075134171,4058075134140,4058075134232,4058075134201,4058075210684,4058075210714,4058075210745,4058075210776,4052899971622,4052899971615,4058075056923,4052899971646,4058075134294,4058075134263,4058075134355,4058075134324,4058075210806,4058075210837,4058075210868,4058075210899,4058075055414,4058075055353,4058075055438,4058075282544,4058075282575,4058075282629,4058075282650,4058075463165,4058075463189,4058075463288,4058075463301,4058075463202,4058075463226,4058075463240,4058075463264,4058075463127,4058075463349,4058075463141,4058075264267,4058075264304,4058075264083,4058075264069,4058075264106,4052899961289,4052899961302,4058075448629,4058075448544,4058075448520,4058075448605,4058075448568,4058075448643,4058075448988,4058075318274,4058075467620,4058075467668,4058075467705,4058075467767,4058075467873,4058075467934"]
["RU C-DE.AYA46.B.85894 29.06.2018-28.06.2023 ROSTEST-Moskva.pdf","4058075135086,4058075135109,4058075024915,4058075024939,4058075024977,4058075024991"]
["EAC RU C-DE.AYA46.B.14999_20 11.08.2020-10.08.2025 Rostest-Moskva.pdf","4058075106635,4058075106666,4058075210929,4058075210950,4058075448803,4058075448827,4058075496378,4058075496408"]
{"$rows_left_out":37}
{"sheet":"Options","index":2,"n_rows":267,"n_cols":14,"rows_kept":267,"cut":false,"hidden":false,"merged":[]}
["yes",1,null,"Audio","MediaAudio",null,"No Language ","NO_LANG",null,"Afghanistan","AF",null,"N/A","NOTSET"]
["no",0,null,"Video","MediaVideo",null,"Deutsch ","DE",null,"Albania","AL",null,"free to use - no limitation","donotdistribute"]
[null,null,null,"360 deg. product video","MediaVideo360",null,"Bosnian ","BS",null,"Algeria","DZ",null,"Rights for LEDVANCE and Partner","im_oap"]
[null,null,null,"Preview Thumbnail","MediaAudioVideoPreviewThumbnail",null,"Bulgarian ","BG",null,"Andorra","AD",null,"Rights only for the purposes of all LEDVANCE Companies","im_oc"]
[null,null,null,"Software","SoftwareSoftware",null,"Croatian ","HR",null,"Angola","AO",null,"Invisible (Thinkstock / LEDVANCE only)","Invisible"]
[null,null,null,"Background: white, horizontal, OSRAM logo","ProdImgBackWhiteHorizOsrLogoFlat",null,"Czech ","CS",null,"Antigua and Barbuda","AG"]
[null,null,null,"Background: white, horizontal, LEDVANCE logo","ProdImgBackWhiteHorizLdvLogoFlat",null,"Danish ","DA",null,"Argentina","AR"]
[null,null,null,"Background: white, horizontal, SYLVANIA logo","ProdImgBackWhiteHorizSylLogoFlat",null,"Dutch ","NL",null,"Armenia","AM"]
[null,null,null,"Background: white, upright, OSRAM logo","ProdImgBackWhiteUprightOsrLogoFlat",null,"English ","EN",null,"Australia","AU"]
[null,null,null,"Background: white, upright, LEDVANCE logo","ProdImgBackWhiteUprightLdvLogoFlat",null,"Estonian ","ET",null,"Austria","AT"]
{"$rows_left_out":258}
{"sheet":"Sheet1","index":3,"n_rows":37,"n_cols":2,"rows_kept":37,"cut":false,"hidden":false,"merged":[]}
["Import Datei Name"]
["50047683 001 CB report and certificate.pdf",{"$f":"VLOOKUP(A2,Sheet2!A:B,2,0)","v":{"$error":"#N/A"}}]
["BY_112 03.11.002 20517 20.08.2019-20.08.2024.pdf",{"$f":"VLOOKUP(A3,Sheet2!A:B,2,0)","v":{"$error":"#N/A"}}]
["BY_112 03.11.002 20679 09.01.2020-09.01.2025.pdf",{"$f":"VLOOKUP(A4,Sheet2!A:B,2,0)","v":{"$error":"#N/A"}}]
["EAC N RU D-DE.MU62.B.00891_20 05.02.2020-04.03.2025 Prommash Test.pdf",{"$f":"VLOOKUP(A5,Sheet2!A:B,2,0)","v":"4058075183001,4058075183087,4058075183063,4058075183100"}]
["EAC N RU D-DE.MU62.B.00928_20 06.03.2020-05.03.2025 Prommash Test.pdf",{"$f":"VLOOKUP(A6,Sheet2!A:B,2,0)","v":"4052899971622,4052899971615,4058075056923,4052899971646,4058075134294,4058075134263,4058075134355,4058075134324,4058075210806,4058075210837,4058075210868,4058075210899,4058075068377,4052899971639,4058075212459,4058075212480,4058075212510,4058075212541,4058075218147,4058075218178,4058075218208,4058075218239,4052899971660,4058075160842,4058075160897,4052899981126,4052899981133,4052899981140,4052899981157,4058075373594,4058075373624,4058075129009,4058075129030,4058075129061,4058075129092,4058075129122,4058075129153,4058075229068,4058075229099,4058075229006,4058075229037,4058075318274,4058075467705,4058075467767,4058075467934,4058075480407,4058075480438,4058075480469,4058075480490,4058075480520,4058075480551,4058075480582,4058075480612,4058075481107,4058075481138,4058075481169,4058075481190,4058075481220,4058075481251,4058075481282,4058075481312"}]
["EAC N RU D-DE.MU62.B.01057_20 13.03.2020-12.03.2025 Prommash Test.pdf",{"$f":"VLOOKUP(A7,Sheet2!A:B,2,0)","v":"4058075135529,4058075135567,4058075135604,4058075135543,4058075135581,4058075817739,4058075817777,4058075817753,4058075817791"}]
["EAC N RU D-DE.MU62.B.01070_20 16.03.2020-15.03.2025 Prommash Test.pdf",{"$f":"VLOOKUP(A8,Sheet2!A:B,2,0)","v":"4058075377462,4058075377486,4058075377509,4058075377523,4058075377547,4058075377561"}]
["EAC N RU D-DE.MU62.B.01076_20 16.03.2020-15.03.2025 Prommash Test.pdf",{"$f":"VLOOKUP(A9,Sheet2!A:B,2,0)","v":"4058075135444,4058075135468,4058075135482,4058075135505"}]
["EAC N RU D-DE.MU62.B.01095_20 16.03.2020-15.03.2025 Prommash Test.pdf",{"$f":"VLOOKUP(A10,Sheet2!A:B,2,0)","v":"4058075362949,4058075362963,4058075124783,4058075124806,4058075124820,4058075124844,4058075127234,4058075124868,4058075124943,4058075124967,4058075124981,4058075125001,4058075284722,4058075284746"}]
{"$rows_left_out":27}